Target
Induced myeloid leukemia cell differentiation protein Mcl-1
Ligand
BDBM50351805
Substrate
Meas. Tech.
ChEMBL_765262 (CHEMBL1827901)
Ki
149±n/a nM
Citation
 Zhang, ZYang, HWu, GLi, ZSong, TLi, XQ Probing the difference between BH3 groove of Mcl-1 and Bcl-2 protein: Implications for dual inhibitors design. Eur J Med Chem 46:3909-16 (2011)  
Target
Name:
Induced myeloid leukemia cell differentiation protein Mcl-1
Synonyms:
BCL2L3 Bcl-2-like protein 3 (Mcl-1) Bcl2-L-3 MCL1 Mcl-1 Myeloid cell leukemia sequence 1 (BCL2-related) | mcl1/EAT
Type:
Membrane; Single-pass membrane protein
Mol. Mass.:
37332.87
Organism:
Homo sapiens (Human)
Description:
Q07820
Residue:
350
  
Inhibitor
Name:
BDBM50351805
Synonyms:
CHEMBL1824188
Type:
Small organic molecule
Emp. Form.:
C22H12N2O3
Mol. Mass.:
352.3423
SMILES:
COc1ccccc1Oc1ccc2c3c(C#N)c(=O)nc3c3cccc1c23
: