Target
TGF-beta receptor type-1
Ligand
BDBM50351810
Substrate
Meas. Tech.
ChEMBL_765278 (CHEMBL1827917)
IC50
38±n/a nM
Citation
 Jin, CHSreenu, DKrishnaiah, MSubrahmanyam, VBRao, KSNagendra Mohan, AVPark, CYSon, JYSon, DHPark, HJSheen, YYKim, DK Synthesis and biological evaluation of 1-substituted-3(5)-(6-methylpyridin-2-yl)-4-(quinoxalin-6-yl)pyrazoles as transforming growth factor-ß type 1 receptor kinase inhibitors. Eur J Med Chem 46:3917-25 (2011)  
Target
Name:
TGF-beta receptor type-1
Synonyms:
ALK-5 Activin A receptor type II-like protein kinase of 53kD SKR4 TGF-beta receptor type I TGFBR1 TGFR1_HUMAN Transforming growth factor-beta receptor type I
Type:
enzyme
Mol. Mass.:
55968.24
Organism:
Homo sapiens (Human)
Description:
P36897
Residue:
503
  
Inhibitor
Name:
BDBM50351810
Synonyms:
CHEMBL1824226
Type:
Small organic molecule
Emp. Form.:
C25H20N6O
Mol. Mass.:
420.4659
SMILES:
Cc1cccc(n1)-c1nn(CC(=O)Nc2ccccc2)cc1-c1ccc2nccnc2c1
: