Target
Aromatase
Ligand
BDBM50014788
Substrate
Meas. Tech.
ChEMBL_765426 (CHEMBL1828368)
IC50
20±n/a nM
Citation
 Doiron, JSoultan, AHRichard, RTouré, MMPicot, NRichard, RCuperlovic-Culf, MRobichaud, GATouaibia, M Synthesis and structure-activity relationship of 1- and 2-substituted-1,2,3-triazole letrozole-based analogues as aromatase inhibitors. Eur J Med Chem 46:4010-24 (2011)  
Target
Name:
Aromatase
Synonyms:
ARO1 CP19A_HUMAN CYP19 CYPXIX Cytochrome P450 19A1 Cytochrome P450-C19 (CYP19) FL cytokine receptor precursor | P-450AROM
Type:
Enzyme
Mol. Mass.:
57888.92
Organism:
Homo sapiens (Human)
Description:
P11511
Residue:
503
  
Inhibitor
Name:
BDBM50014788
Synonyms:
1-Benzhydryl-1H-imidazole | CHEMBL336638
Type:
Small organic molecule
Emp. Form.:
C16H14N2
Mol. Mass.:
234.2958
SMILES:
c1cn(cn1)C(c1ccccc1)c1ccccc1
: