Target
Serine/threonine-protein kinase mTOR
Ligand
BDBM50351956
Substrate
Meas. Tech.
ChEMBL_766022 (CHEMBL1828260)
IC50
430±n/a nM
Citation
 Stec, MMAndrews, KLBooker, SKCaenepeel, SFreeman, DJJiang, JLiao, HMcCarter, JMullady, ELSan Miguel, TSubramanian, RTamayo, NWang, LYang, KZalameda, LPZhang, NHughes, PENorman, MH Structure-activity relationships of phosphoinositide 3-kinase (PI3K)/mammalian target of rapamycin (mTOR) dual inhibitors: investigations of various 6,5-heterocycles to improve metabolic stability. J Med Chem 54:5174-84 (2011)  
Target
Name:
Serine/threonine-protein kinase mTOR
Synonyms:
FK506-binding protein 12-rapamycin complex-associated protein 1 FRAP FRAP1 MTOR Mammalian Target of Rapamycin (mTOR) RAFT1 Rapamycin and FKBP12 target 1 Serine/threonine-protein kinase (mTOR) | mTORC2
Type:
Rapamycin target protein
Mol. Mass.:
288917.12
Organism:
Homo sapiens (Human)
Description:
P42345
Residue:
2549
  
Inhibitor
Name:
BDBM50351956
Synonyms:
CHEMBL1822208
Type:
Small organic molecule
Emp. Form.:
C18H13ClFN5O2S
Mol. Mass.:
417.845
SMILES:
Nc1nc2ccc(cc2[nH]1)-c1cnc(Cl)c(NS(=O)(=O)c2ccc(F)cc2)c1
: