Target
3-dehydroquinate dehydratase
Ligand
BDBM50352029
Substrate
Meas. Tech.
ChEMBL_766423 (CHEMBL1826563)
Ki
120±n/a nM
Citation
 Tizón, LOtero, JMPrazeres, VFLlamas-Saiz, ALFox, GCvan Raaij, MJLamb, HHawkins, ARAinsa, JACastedo, LGonzález-Bello, C A prodrug approach for improving antituberculosis activity of potent Mycobacterium tuberculosis type II dehydroquinase inhibitors. J Med Chem 54:6063-84 (2011)  
Target
Name:
3-dehydroquinate dehydratase
Synonyms:
AROQ_MYCTU aroQ
Type:
PROTEIN
Mol. Mass.:
15786.25
Organism:
Mycobacterium tuberculosis
Description:
ChEMBL_766423
Residue:
147
  
Inhibitor
Name:
BDBM50352029
Synonyms:
CHEMBL1823558
Type:
Small organic molecule
Emp. Form.:
C16H17FO6
Mol. Mass.:
324.301
SMILES:
O[C@@H]1C[C@@](O)(C=C(\C=C\COc2ccc(F)cc2)[C@H]1O)C(O)=O
: