Target
Mu-type opioid receptor
Ligand
BDBM50352117
Substrate
Meas. Tech.
ChEMBL_767030 (CHEMBL1828461)
Ki
0.670000±n/a nM
Citation
 Yuan, YElbegdorj, OChen, JAkubathini, SKBeletskaya, IOSelley, DEZhang, Y Structure selectivity relationship studies of 17-cyclopropylmethyl-3,14ß-dihydroxy-4,5a-epoxy-6ß-[(4'-pyridyl)carboxamido]morphinan derivatives toward the development of the mu opioid receptor antagonists. Bioorg Med Chem Lett 21:5625-9 (2011)  
Target
Name:
Mu-type opioid receptor
Synonyms:
M-OR-1 MOR-1 MUOR1 Mu opiate receptor OPRM1 hMOP | mu-type opioid receptor isoform MOR-1
Type:
G Protein-Coupled Receptor (GPCR)
Mol. Mass.:
44789.51
Organism:
Homo sapiens (Human)
Description:
P35372
Residue:
400
  
Inhibitor
Name:
BDBM50352117
Synonyms:
CHEMBL1824514 | CHEMBL1852672
Type:
Small organic molecule
Emp. Form.:
C26H28ClN3O4
Mol. Mass.:
481.971
SMILES:
Oc1ccc2C[C@H]3N(CC4CC4)CC[C@@]45[C@@H](Oc1c24)[C@@H](CC[C@@]35O)NC(=O)c1ccncc1Cl
: