Target
Bcl-2-like protein 1
Ligand
BDBM50352199
Substrate
Meas. Tech.
ChEMBL_767333 (CHEMBL1825445)
Kd
3.784E5±n/a nM
Citation
 Rega, MFWu, BWei, JZhang, ZCellitti, JFPellecchia, M SAR by interligand nuclear overhauser effects (ILOEs) based discovery of acylsulfonamide compounds active against Bcl-x(L) and Mcl-1. J Med Chem 54:6000-13 (2011)  
Target
Name:
Bcl-2-like protein 1
Synonyms:
Anti-apoptotic Bcl-2 protein Apoptosis regulator Bcl-X BCL2-like 1 isoform 1 BCL2L1 Bcl-2-like protein 1 (Bcl-XL) Bcl-xL/Bcl-2-binding component 3 Bcl2-antagonist of cell death (BAD)
Type:
Mitochondrion membrane; Single-pass membrane protein
Mol. Mass.:
26039.60
Organism:
Homo sapiens (Human)
Description:
Residue:
233
  
Inhibitor
Name:
BDBM50352199
Synonyms:
CHEMBL1824799
Type:
Small organic molecule
Emp. Form.:
C12H15NO2
Mol. Mass.:
205.253
SMILES:
OC(=O)c1ccccc1N1CCCCC1
: