Target
Aurora kinase A
Ligand
BDBM50352331
Substrate
Meas. Tech.
ChEMBL_766652 (CHEMBL1827218)
Kd
58±n/a nM
Citation
 Abraham, SHadd, MJTran, LVickers, TSindac, JMilanov, ZVHolladay, MWBhagwat, SSHua, HFord Pulido, JMCramer, MDGitnick, DJames, JDao, ABelli, BArmstrong, RCTreiber, DKLiu, G Novel series of pyrrolotriazine analogs as highly potent pan-Aurora kinase inhibitors. Bioorg Med Chem Lett 21:5296-300 (2011)  
Target
Name:
Aurora kinase A
Synonyms:
AIK ARK1 AURKA AYK1 Aurora kinase A (AURA) Aurora kinase A (Aurora A) Aurora-related kinase 1 BTAK Breast-tumor-amplified kinase STK15 Serine/threonine kinase 15 Serine/threonine-protein kinase aurora A hARK1
Type:
Serine/threonine-protein kinase
Mol. Mass.:
45830.98
Organism:
Homo sapiens (Human)
Description:
O14965
Residue:
403
  
Inhibitor
Name:
BDBM50352331
Synonyms:
CHEMBL1822645
Type:
Small organic molecule
Emp. Form.:
C23H26N8O3S
Mol. Mass.:
494.569
SMILES:
Cc1cc(Nc2nc(Sc3ccc(NC(=O)CN4C[C@H](O)C[C@H]4CO)cc3)nn3cccc23)n[nH]1
: