Target
Aurora kinase A
Ligand
BDBM50352492
Substrate
Meas. Tech.
ChEMBL_767045 (CHEMBL1828476)
IC50
>100000000±n/a nM
Citation
 Monte, FLKramer, TBoländer, APlotkin, BEldar-Finkelman, HFuertes, ADominguez, JSchmidt, B Synthesis and biological evaluation of glycogen synthase kinase 3 (GSK-3) inhibitors: an fast and atom efficient access to 1-aryl-3-benzylureas. Bioorg Med Chem Lett 21:5610-5 (2011)  
Target
Name:
Aurora kinase A
Synonyms:
AIK ARK1 AURKA AYK1 Aurora kinase A (AURA) Aurora kinase A (Aurora A) Aurora-related kinase 1 BTAK Breast-tumor-amplified kinase STK15 Serine/threonine kinase 15 Serine/threonine-protein kinase aurora A hARK1
Type:
Serine/threonine-protein kinase
Mol. Mass.:
45830.98
Organism:
Homo sapiens (Human)
Description:
O14965
Residue:
403
  
Inhibitor
Name:
BDBM50352492
Synonyms:
CHEMBL1824540
Type:
Small organic molecule
Emp. Form.:
C16H14N4O4S
Mol. Mass.:
358.372
SMILES:
COc1ccc(CNC(=O)Nc2nc3ccc(cc3s2)[N+]([O-])=O)cc1
: