Target
Hepatocyte growth factor receptor
Ligand
BDBM50352561
Substrate
Meas. Tech.
ChEMBL_767240 (CHEMBL1825352)
Ki
460±n/a nM
Citation
 Cui, JJTran-Dubé, MShen, HNambu, MKung, PPPairish, MJia, LMeng, JFunk, LBotrous, IMcTigue, MGrodsky, NRyan, KPadrique, EAlton, GTimofeevski, SYamazaki, SLi, QZou, HChristensen, JMroczkowski, BBender, SKania, RSEdwards, MP Structure based drug design of crizotinib (PF-02341066), a potent and selective dual inhibitor of mesenchymal-epithelial transition factor (c-MET) kinase and anaplastic lymphoma kinase (ALK). J Med Chem 54:6342-63 (2011)  
Target
Name:
Hepatocyte growth factor receptor
Synonyms:
Hepatocyte growth factor receptor Hepatocyte growth factor receptor (c-MET) MET Met proto-oncogene (hepatocyte growth factor receptor) Tyrosine-protein kinase Met (c-Met) c-Met kinase
Type:
Protein
Mol. Mass.:
155559.73
Organism:
Homo sapiens (Human)
Description:
P08581
Residue:
1390
  
Inhibitor
Name:
BDBM50352561
Synonyms:
CHEMBL1824866
Type:
Small organic molecule
Emp. Form.:
C28H30Cl2N4O2
Mol. Mass.:
525.469
SMILES:
Nc1ncc(cc1OCc1c(Cl)cccc1Cl)-c1ccc(cc1)C(=O)N1CCC[C@@H]1CN1CCCC1
: