Target
Hepatocyte growth factor receptor
Ligand
BDBM50352557
Substrate
Meas. Tech.
ChEMBL_767240 (CHEMBL1825352)
Ki
35±n/a nM
Citation
 Cui, JJTran-Dubé, MShen, HNambu, MKung, PPPairish, MJia, LMeng, JFunk, LBotrous, IMcTigue, MGrodsky, NRyan, KPadrique, EAlton, GTimofeevski, SYamazaki, SLi, QZou, HChristensen, JMroczkowski, BBender, SKania, RSEdwards, MP Structure based drug design of crizotinib (PF-02341066), a potent and selective dual inhibitor of mesenchymal-epithelial transition factor (c-MET) kinase and anaplastic lymphoma kinase (ALK). J Med Chem 54:6342-63 (2011)  
Target
Name:
Hepatocyte growth factor receptor
Synonyms:
Hepatocyte growth factor receptor Hepatocyte growth factor receptor (c-MET) MET Met proto-oncogene (hepatocyte growth factor receptor) Tyrosine-protein kinase Met (c-Met) c-Met kinase
Type:
Protein
Mol. Mass.:
155559.73
Organism:
Homo sapiens (Human)
Description:
P08581
Residue:
1390
  
Inhibitor
Name:
BDBM50352557
Synonyms:
CHEMBL1825134
Type:
Small organic molecule
Emp. Form.:
C19H18Cl2FN5O
Mol. Mass.:
422.284
SMILES:
CC(Oc1cc(cnc1N)-c1cnn(c1)C1CNC1)c1c(Cl)ccc(F)c1Cl
: