Target
Angiopoietin-1 receptor
Ligand
BDBM50306682
Substrate
Meas. Tech.
ChEMBL_767252 (CHEMBL1825364)
IC50
448±n/a nM
Citation
 Cui, JJTran-Dubé, MShen, HNambu, MKung, PPPairish, MJia, LMeng, JFunk, LBotrous, IMcTigue, MGrodsky, NRyan, KPadrique, EAlton, GTimofeevski, SYamazaki, SLi, QZou, HChristensen, JMroczkowski, BBender, SKania, RSEdwards, MP Structure based drug design of crizotinib (PF-02341066), a potent and selective dual inhibitor of mesenchymal-epithelial transition factor (c-MET) kinase and anaplastic lymphoma kinase (ALK). J Med Chem 54:6342-63 (2011)  
Target
Name:
Angiopoietin-1 receptor
Synonyms:
Hyk Tek Tie2 | Tyrosine-protein kinase TIE-2
Type:
PROTEIN
Mol. Mass.:
125702.79
Organism:
Mus musculus
Description:
ChEMBL_767252
Residue:
1122
  
Inhibitor
Name:
BDBM50306682
Synonyms:
(R)-3-(1-(2,6-dichloro-3-fluorophenyl)ethoxy)-5-(1-(piperidin-4-yl)-1H-pyrazol-4-yl)pyridin-2-amine 3-[(1R)-1-(2,6-dichloro-3-fluorophenyl)ethoxy]-5-(1-piperidin-4-yl-1H-pyrazol-4-yl)pyridin-2-amine CRIZOTINIB US10370379, Crizotinib US10780082, Compound Crizotinib US11517561, Compound Crizotinib US9199944, Crizotinib | US9226923, Crizotinib
Type:
Small organic molecule
Emp. Form.:
C21H22Cl2FN5O
Mol. Mass.:
450.337
SMILES:
C[C@@H](Oc1cc(cnc1N)-c1cnn(c1)C1CCNCC1)c1c(Cl)ccc(F)c1Cl
: