Target
Mitogen-activated protein kinase 8
Ligand
BDBM50352629
Substrate
Meas. Tech.
ChEMBL_766265 (CHEMBL1826507)
Ki
1.5±n/a nM
Citation
 Stebbins, JLDe, SKPavlickova, PChen, VMachleidt, TChen, LHKuntzen, CKitada, SKarin, MPellecchia, M Design and characterization of a potent and selective dual ATP- and substrate-competitive subnanomolar bidentate c-Jun N-terminal kinase (JNK) inhibitor. J Med Chem 54:6206-14 (2011)  
Target
Name:
Mitogen-activated protein kinase 8
Synonyms:
JNK-46 JNK1-alpha-1 MK08_HUMAN PRKM8 SAPK1C c-Jun N-terminal kinase 1 c-Jun N-terminal kinase 1(JNK1) | c-Jun N-terminal kinase 2 (JNK2)
Type:
Enzyme
Mol. Mass.:
48297.57
Organism:
Homo sapiens (Human)
Description:
JNK-1 was purchased from Upstate Cell Signaling Solutions (formerly Upstate Biotechnology).
Residue:
427
  
Inhibitor
Name:
BDBM50352629
Synonyms:
CHEMBL1822314
Type:
Small organic molecule
Emp. Form.:
C116H198N50O27
Mol. Mass.:
2725.1321
SMILES:
CC(C)C[C@@H](NC(=O)CNC(=O)CNC(=O)CCCNC(=O)c1ccc(cc1)-c1n[nH]c2ccccc12)C(=O)N[C@H](CC(N)=O)C(=O)N[C@H](CC(C)C)C(=O)N[C@H]([C@H](C)O)C(=O)N[C@H]([C@H](C)O)C(=O)N1CCC[C@@H]1C(=O)N[C@H](CCCN=C(N)N)C(=O)NCC(=O)NCC(=O)N[C@H](CCCN=C(N)N)C(=O)N[C@H](CCCN=C(N)N)C(=O)N[C@H](CCCN=C(N)N)C(=O)N[C@H](CCC(N)=O)C(=O)N[C@H](CCCN=C(N)N)C(=O)N[C@H](CCCN=C(N)N)C(=O)N[C@H](CCCCN)C(=O)N[C@H](CCCCN)C(=O)N[C@H](CCCN=C(N)N)C(=O)NCC(N)=O
: