Target
ALK tyrosine kinase receptor
Ligand
BDBM50352764
Substrate
Meas. Tech.
ChEMBL_766970 (CHEMBL1828297)
IC50
2.7±n/a nM
Citation
 Kinoshita, KKobayashi, TAsoh, KFuruichi, NIto, TKawada, HHara, SOhwada, JHattori, KMiyagi, THong, WSPark, MJTakanashi, KTsukaguchi, TSakamoto, HTsukuda, TOikawa, N 9-substituted 6,6-dimethyl-11-oxo-6,11-dihydro-5H-benzo[b]carbazoles as highly selective and potent anaplastic lymphoma kinase inhibitors. J Med Chem 54:6286-94 (2011)  
Target
Name:
ALK tyrosine kinase receptor
Synonyms:
ALK ALK_HUMAN CD_antigen: CD246
Type:
Protein
Mol. Mass.:
176453.10
Organism:
Homo sapiens (Human)
Description:
Q9UM73
Residue:
1620
  
Inhibitor
Name:
BDBM50352764
Synonyms:
CHEMBL1823220
Type:
Small organic molecule
Emp. Form.:
C28H26N4O2
Mol. Mass.:
450.5316
SMILES:
CC1(C)c2[nH]c3cc(ccc3c2C(=O)c2cc(C#C)c(cc12)N1CCN(CC1)C1COC1)C#N
: