Target
Beta-secretase 1
Ligand
BDBM50352881
Substrate
Meas. Tech.
ChEMBL_767496 (CHEMBL1825608)
EC50
230±n/a nM
Citation
 Malamas, MSErdei, JGunawan, IBarnes, KHui, YJohnson, MRobichaud, AZhou, PYan, YSolvibile, WTurner, JFan, KYChopra, RBard, JPangalos, MN New pyrazolyl and thienyl aminohydantoins as potent BACE1 inhibitors: exploring the S2' region. Bioorg Med Chem Lett 21:5164-70 (2011)  
Target
Name:
Beta-secretase 1
Synonyms:
ASP2 Aspartyl protease 2 BACE1 Beta-secretase (BACE) Beta-secretase 1 (BACE 1) Beta-secretase 1 (BACE1) Beta-site amyloid precursor protein cleaving enzyme 1 Memapsin-2 beta-Secretase (BACE-1) | beta-Secretase (BACE1)
Type:
Protein
Mol. Mass.:
55755.10
Organism:
Homo sapiens (Human)
Description:
P56817
Residue:
501
  
Inhibitor
Name:
BDBM50352881
Synonyms:
CHEMBL1824350
Type:
Small organic molecule
Emp. Form.:
C21H21N5OS
Mol. Mass.:
391.489
SMILES:
CCc1cc(c(C)s1)C1(N=C(N)N(C)C1=O)c1cccc(c1)-c1cncnc1
: