Target
Cytosol aminopeptidase
Ligand
BDBM50336495
Substrate
Meas. Tech.
ChEMBL_766294 (CHEMBL1826226)
Ki
>100000±n/a nM
Citation
 Maiereanu, CSchmitt, CSchifano-Faux, NLe Nouën, DDefoin, ATarnus, C A novel amino-benzosuberone derivative is a picomolar inhibitor of mammalian aminopeptidase N/CD13. Bioorg Med Chem 19:5716-33 (2011)  
Target
Name:
Cytosol aminopeptidase
Synonyms:
AMPL_BOVIN LAP3 Leucine Aminopeptidase | Leucyl aminopeptidase
Type:
Homohexamer
Mol. Mass.:
56288.28
Organism:
Bos taurus (bovine)
Description:
Bovine kidney LAPc was purchased from Sigma Chemical Co.
Residue:
519
  
Inhibitor
Name:
BDBM50336495
Synonyms:
7-Amino-5,7,8,9-tetrahydro-benzocyclohepten-6-one, hydrochloride | CHEMBL1668626
Type:
Small organic molecule
Emp. Form.:
C11H13NO
Mol. Mass.:
175.227
SMILES:
NC1CCc2ccccc2CC1=O
: