Target
Neuropeptide Y receptor type 5
Ligand
BDBM50353151
Substrate
Meas. Tech.
ChEMBL_768586 (CHEMBL1832605)
Ki
0.6±n/a nM
Citation
 Wu, LLu, KDesai, MPackiarajan, MJoshi, AMarzabadi, MRJubian, VAndersen, KChandrasena, GBoyle, NJWalker, MW N-Heteroaryl glycinamides and glycinamines as potent NPY5 antagonists. Bioorg Med Chem Lett 21:5573-6 (2011)  
Target
Name:
Neuropeptide Y receptor type 5
Synonyms:
NPY-Y5 NPY5-R NPY5R_HUMAN NPYY5 Neuropeptide Y receptor type 5 ( NPY Y5) | Y5 receptor
Type:
Enzyme
Mol. Mass.:
50746.64
Organism:
Homo sapiens (Human)
Description:
Q15761
Residue:
445
  
Inhibitor
Name:
BDBM50353151
Synonyms:
CHEMBL1829323
Type:
Small organic molecule
Emp. Form.:
C20H30ClN3O3S2
Mol. Mass.:
460.054
SMILES:
CC(C)S(=O)(=O)NC[C@H]1CC[C@@H](CC1)NC(=O)CN1CCSc2cc(Cl)ccc12
: