Target
Neuropeptide Y receptor type 5
Ligand
BDBM50353158
Substrate
Meas. Tech.
ChEMBL_768586 (CHEMBL1832605)
Ki
60±n/a nM
Citation
 Wu, LLu, KDesai, MPackiarajan, MJoshi, AMarzabadi, MRJubian, VAndersen, KChandrasena, GBoyle, NJWalker, MW N-Heteroaryl glycinamides and glycinamines as potent NPY5 antagonists. Bioorg Med Chem Lett 21:5573-6 (2011)  
Target
Name:
Neuropeptide Y receptor type 5
Synonyms:
NPY-Y5 NPY5-R NPY5R_HUMAN NPYY5 Neuropeptide Y receptor type 5 ( NPY Y5) | Y5 receptor
Type:
Enzyme
Mol. Mass.:
50746.64
Organism:
Homo sapiens (Human)
Description:
Q15761
Residue:
445
  
Inhibitor
Name:
BDBM50353158
Synonyms:
CHEMBL1829330
Type:
Small organic molecule
Emp. Form.:
C20H32ClN3O3S
Mol. Mass.:
430.004
SMILES:
CC(C)S(=O)(=O)NC[C@H]1CC[C@@H](CC1)NCCN1CCOc2ccc(Cl)cc12
: