Target
Metabotropic glutamate receptor 4
Ligand
BDBM50353291
Substrate
Meas. Tech.
ChEMBL_768726 (CHEMBL1831599)
EC50
7±n/a nM
Citation
 Hong, SPLiu, KGMa, GSabio, MUberti, MABacolod, MDPeterson, JZou, ZZRobichaud, AJDoller, D Tricyclic thiazolopyrazole derivatives as metabotropic glutamate receptor 4 positive allosteric modulators. J Med Chem 54:5070-81 (2011)  
Target
Name:
Metabotropic glutamate receptor 4
Synonyms:
GPRC1D GRM4_HUMAN MGLUR4 Metabotropic glutamate receptor 4 (mGlu4) metabotropic glutamate 4
Type:
Protein
Mol. Mass.:
101899.95
Organism:
Homo sapiens (Human)
Description:
Q14833
Residue:
912
  
Inhibitor
Name:
BDBM50353291
Synonyms:
CHEMBL1830711
Type:
Small organic molecule
Emp. Form.:
C13H12N6S
Mol. Mass.:
284.34
SMILES:
C1Cc2[nH]ncc2-c2nc(Nc3ncccn3)sc2C1
: