Target
Androgen receptor
Ligand
BDBM50319612
Substrate
Meas. Tech.
ChEMBL_768071 (CHEMBL1833027)
IC50
28.0±n/a nM
Citation
 Sexton, KEBarrett, SBridgwood, KCarroll, MDettling, DDu, DFakhoury, SFedij, VHu, LYKostlan, CPocalyko, DRaheja, NSmith, YShanmugasundaram, VWade, K Pantolactams as androgen receptor antagonists for the topical suppression of sebum production. Bioorg Med Chem Lett 21:5230-3 (2011)  
Target
Name:
Androgen receptor
Synonyms:
ANDR_HUMAN Androgen Receptor Androgen receptor/Baculoviral IAP repeat-containing protein 2 Dihydrotestosterone receptor Nuclear receptor subfamily 3 group C member 4
Type:
Receptor
Mol. Mass.:
99185.27
Organism:
Homo sapiens (Human)
Description:
CHO cells were stably transfected with human AR gene.
Residue:
920
  
Inhibitor
Name:
BDBM50319612
Synonyms:
(R)-(+)-4-[4,4-Dimethyl-1-(4-methylsulfanyl-benzyl)-2-oxo-pyrrolidin-3-yloxy]-2-trifluoromethylbenzonitril | CHEMBL1084843
Type:
Small organic molecule
Emp. Form.:
C22H21F3N2O2S
Mol. Mass.:
434.475
SMILES:
CSc1ccc(CN2CC(C)(C)[C@@H](Oc3ccc(C#N)c(c3)C(F)(F)F)C2=O)cc1
: