Target
Cytochrome P450 26A1
Ligand
BDBM50342133
Substrate
Meas. Tech.
ChEMBL_769532 (CHEMBL1833279)
IC50
10±n/a nM
Citation
 Gomaa, MSBridgens, CEVeal, GJRedfern, CPBrancale, AArmstrong, JLSimons, C Synthesis and biological evaluation of 3-(1H-imidazol- and triazol-1-yl)-2,2-dimethyl-3-[4-(naphthalen-2-ylamino)phenyl]propyl derivatives as small molecule inhibitors of retinoic acid 4-hydroxylase (CYP26). J Med Chem 54:6803-11 (2011)  
Target
Name:
Cytochrome P450 26A1
Synonyms:
CP26A_HUMAN CYP26A1 Cytochrome P450 26A1 P450RAI1 | Retinoic acid 4-hydroxylase
Type:
Enzyme
Mol. Mass.:
56216.16
Organism:
Homo sapiens (Human)
Description:
O43174
Residue:
497
  
Inhibitor
Name:
BDBM50342133
Synonyms:
Benzothiazol-2-yl-[4-((1S,2S)-2-dimethylamino-1-imidazol-1-yl-propyl)-phenyl]-amine N-(4-((1R,2R)-2-(dimethylamino)-1-(1H-imidazol-1-yl)propyl)phenyl)benzo[d]thiazol-2-amine | R-116010
Type:
Small organic molecule
Emp. Form.:
C21H23N5S
Mol. Mass.:
377.506
SMILES:
C[C@H]([C@@H](c1ccc(Nc2nc3ccccc3s2)cc1)n1ccnc1)N(C)C
: