Target
Mu-type opioid receptor
Ligand
BDBM50176259
Substrate
Meas. Tech.
ChEMBL_770074 (CHEMBL1832554)
Ki
2400±n/a nM
Citation
 Malinka, WRedzicka, AJastrzebska-Wiesek, MFilipek, BDybala, MKarczmarzyk, ZUrbanczyk-Lipkowska, ZKalicki, P Derivatives of pyrrolo[3,4-d]pyridazinone, a new class of analgesic agents. Eur J Med Chem 46:4992-9 (2011)  
Target
Name:
Mu-type opioid receptor
Synonyms:
MOR-1 Mu-type opioid receptor (MOR) OPRM_RAT Opioid receptor B Ror-b
Type:
G Protein-Coupled Receptor (GPCR)
Mol. Mass.:
44503.11
Organism:
Rattus norvegicus (rat)
Description:
Competition binding assays were carried out using membrane preparations from transfected HN9.10 cells that constitutively expressed the mu opioid receptor.
Residue:
398
  
Inhibitor
Name:
BDBM50176259
Synonyms:
(1R,2R)-2-[(dimethylamino)methyl]-1-(3-methoxyphenyl)cyclohexanol TRAMADOL
Type:
Small organic molecule
Emp. Form.:
C16H25NO2
Mol. Mass.:
263.3752
SMILES:
COc1cccc(c1)[C@@]1(O)CCCC[C@@H]1CN(C)C
: