Target
Sodium/glucose cotransporter 2
Ligand
BDBM50353865
Substrate
Meas. Tech.
ChEMBL_769664 (CHEMBL1831435)
IC50
86.5±n/a nM
Citation
 Lee, SHSong, KSKim, JYKang, MLee, JSCho, SHPark, HJKim, JLee, J Novel thiophenyl C-aryl glucoside SGLT2 inhibitors as potential antidiabetic agents. Bioorg Med Chem 19:5813-32 (2011)  
Target
Name:
Sodium/glucose cotransporter 2
Synonyms:
Na(+)/glucose cotransporter 2 SGLT2 Sodium-Dependent Glucose Cotransporter 2 (SGLT2) Solute carrier family 5 member 2
Type:
Protein
Mol. Mass.:
72902.00
Organism:
Homo sapiens (Human)
Description:
P31639
Residue:
672
  
Inhibitor
Name:
BDBM50353865
Synonyms:
CHEMBL1830869 | US9006187, 2
Type:
Small organic molecule
Emp. Form.:
C18H21ClO6S
Mol. Mass.:
400.874
SMILES:
COc1ccc(Cc2cc(sc2Cl)[C@@H]2O[C@H](CO)[C@@H](O)[C@H](O)[C@H]2O)cc1
: