Target
Muscarinic acetylcholine receptor M5
Ligand
BDBM50403547
Substrate
Meas. Tech.
ChEMBL_769761 (CHEMBL1831567)
Ki
0.400000±n/a nM
Citation
 Lebar, MDHahn, KNMutka, TMaignan, PMcClintock, JBAmsler, CDvan Olphen, AKyle, DEBaker, BJ CNS and antimalarial activity of synthetic meridianin and psammopemmin analogs. Bioorg Med Chem 19:5756-62 (2011)  
Target
Name:
Muscarinic acetylcholine receptor M5
Synonyms:
ACM5_HUMAN | CHRM5
Type:
PROTEIN
Mol. Mass.:
60102.35
Organism:
Homo sapiens (Human)
Description:
ChEMBL_1517990
Residue:
532
  
Inhibitor
Name:
BDBM50403547
Synonyms:
ATROPEN | ATROPINE
Type:
Small organic molecule
Emp. Form.:
C17H23NO3
Mol. Mass.:
289.3694
SMILES:
CN1[C@H]2CC[C@@H]1C[C@@H](C2)OC(=O)C(CO)c1ccccc1
: