Target
Corticotropin-releasing factor receptor 1
Ligand
BDBM50354035
Substrate
Meas. Tech.
ChEMBL_770318 (CHEMBL1833627)
EC50
81±n/a nM
Citation
 Saito, TObitsu, TMinamoto, CSugiura, TMatsumura, NUeno, SKishi, AKatsumata, SNakai, HToda, M Pyrazolo[1,5-a]pyrimidines, triazolo[1,5-a]pyrimidines and their tricyclic derivatives as corticotropin-releasing factor 1 (CRF¿?) receptor antagonists. Bioorg Med Chem 19:5955-66 (2011)  
Target
Name:
Corticotropin-releasing factor receptor 1
Synonyms:
CRF-R CRFR1_RAT Corticotropin releasing factor receptor Corticotropin-releasing Factor Receptor 1 Crhr | Crhr1
Type:
G Protein-Coupled Receptor (GPCR)
Mol. Mass.:
47870.75
Organism:
Rattus norvegicus (rat)
Description:
Receptor binding assays were performed using rat cortex homogenate.
Residue:
415
  
Inhibitor
Name:
BDBM50354035
Synonyms:
CHEMBL1828889
Type:
Small organic molecule
Emp. Form.:
C20H26ClN5O
Mol. Mass.:
387.906
SMILES:
CCCN(CCC)c1c(C)c(Nc2ccc(OC)cc2Cl)nc2ccnn12
: