Target
Histone deacetylase 7
Ligand
BDBM50354089
Substrate
Meas. Tech.
ChEMBL_770953 (CHEMBL1838192)
IC50
11000±n/a nM
Citation
 Wang, CHenkes, LMDoughty, LBHe, MWang, DMeyer-Almes, FJCheng, YQ Thailandepsins: bacterial products with potent histone deacetylase inhibitory activities and broad-spectrum antiproliferative activities. J Nat Prod 74:2031-8 (2011)  
Target
Name:
Histone deacetylase 7
Synonyms:
HD7 HDAC7A Histone acetylase 7 (HDAC7) Human HDAC7
Type:
Chromatin regulator; hydrolase; repressor
Mol. Mass.:
102942.62
Organism:
Homo sapiens (Human)
Description:
Q8WUI4
Residue:
952
  
Inhibitor
Name:
BDBM50354089
Synonyms:
CHEMBL1836144
Type:
Small organic molecule
Emp. Form.:
C23H39N3O6S3
Mol. Mass.:
549.767
SMILES:
CC[C@H](C)[C@H]1NC(=O)[C@@H](CS)NC(=O)[C@@H](CCSC)NC(=O)C[C@H](OC(=O)C[C@@H]1O)\C=C\CCS
: