Target
Integrin alpha-2/beta-3
Ligand
BDBM50354350
Substrate
Meas. Tech.
ChEMBL_770670 (CHEMBL1839795)
IC50
5.5±n/a nM
Citation
 Krysko, AASamoylenko, GVPolishchuk, PGAndronati, SAKabanova, TAKhristova, TMKuz'min, VEKabanov, VMKrysko, OLVarnek, AAGrygorash, RY RGD mimetics containing phthalimidine fragment as novel ligands of fibrinogen receptor. Bioorg Med Chem Lett 21:5971-4 (2011)  
Target
Name:
Integrin alpha-2/beta-3
Synonyms:
Type:
Mol. Mass.:
Description:
ASSAY_ID of EBI is 770669
Components:
This complex has 2 components.
Component 1
Name:
Integrin beta-3
Synonyms:
CD_antigen=CD61 GPIIIa ITGB3 Platelet membrane glycoprotein IIIa
Type:
Protein
Mol. Mass.:
87038.91
Organism:
Homo sapiens (Human)
Description:
P05106
Residue:
788
  
Component 2
Name:
Integrin alpha-2
Synonyms:
CD49B Collagen receptor ITA2_HUMAN Integrin alpha-2 precursor Platelet membrane glycoprotein Ia | VLA-2 alpha chain
Type:
Single-pass type I membrane protein
Mol. Mass.:
129273.27
Organism:
Homo sapiens (Human)
Description:
Residue:
1181
  
Inhibitor
Name:
BDBM50354350
Synonyms:
CHEMBL1836344
Type:
Small organic molecule
Emp. Form.:
C20H27N3O4
Mol. Mass.:
373.4461
SMILES:
OC(=O)CCN1Cc2ccc(NC(=O)CCCC3CCNCC3)cc2C1=O
: