Target
Carbonic anhydrase 12
Ligand
BDBM50354400
Substrate
Meas. Tech.
ChEMBL_770699 (CHEMBL1839824)
Ki
76±n/a nM
Citation
 Knaus, EEInnocenti, AScozzafava, ASupuran, CT Phenylethynylbenzenesulfonamide regioisomers strongly and selectively inhibit the transmembrane, tumor-associated carbonic anhydrase isoforms IX and XII over the cytosolic isoforms I and II. Bioorg Med Chem Lett 21:5892-6 (2011)  
Target
Name:
Carbonic anhydrase 12
Synonyms:
CA-XII CAH12_HUMAN Carbonic anhydrase Carbonic anhydrase XII Carbonic anhydrase XII (CAXII) | Tumor antigen HOM-RCC-3.1.3
Type:
Enzyme
Mol. Mass.:
39456.00
Organism:
Homo sapiens (Human)
Description:
Catalytic domain of human cloned isozyme was used in the assay
Residue:
354
  
Inhibitor
Name:
BDBM50354400
Synonyms:
CHEMBL1836403
Type:
Small organic molecule
Emp. Form.:
C14H10FNO2S
Mol. Mass.:
275.298
SMILES:
NS(=O)(=O)c1ccc(cc1)C#Cc1cccc(F)c1
: