Target
Mu-type opioid receptor
Ligand
BDBM50354647
Substrate
Meas. Tech.
ChEMBL_771171 (CHEMBL1837088)
Ki
0.025000±n/a nM
Citation
 De Wachter, Rde Graaf, CKeresztes, AVandormael, BBallet, STóth, GRognan, DTourwé, D Synthesis, biological evaluation, and automated docking of constrained analogues of the opioid peptide H-Dmt-D-Ala-Phe-Gly-NH2 using the 4- or 5-methyl substituted 4-amino-1,2,4,5-tetrahydro-2-benzazepin-3-one scaffold. J Med Chem 54:6538-47 (2011)  
Target
Name:
Mu-type opioid receptor
Synonyms:
MOR-1 Mu-type opioid receptor (MOR) OPRM_RAT Opioid receptor B Ror-b
Type:
G Protein-Coupled Receptor (GPCR)
Mol. Mass.:
44503.11
Organism:
Rattus norvegicus (rat)
Description:
Competition binding assays were carried out using membrane preparations from transfected HN9.10 cells that constitutively expressed the mu opioid receptor.
Residue:
398
  
Inhibitor
Name:
BDBM50354647
Synonyms:
CHEMBL1834244
Type:
Small organic molecule
Emp. Form.:
C27H35N5O5
Mol. Mass.:
509.5973
SMILES:
C[C@@H](NC(=O)[C@@H](N)Cc1c(C)cc(O)cc1C)C(=O)N[C@@H]1[C@@H](C)c2ccccc2CN(CC(N)=O)C1=O
: