Target
Acyl-CoA desaturase 1
Ligand
BDBM50354674
Substrate
Meas. Tech.
ChEMBL_771237 (CHEMBL1839319)
IC50
4±n/a nM
Citation
 Ramtohul, YKPowell, DLeclerc, JPLeger, SOballa, RBlack, CIsabel, ELi, CSCrane, SRobichaud, JGuay, JGuiral, SZhang, LHuang, Z Bicyclic heteroaryl inhibitors of stearoyl-CoA desaturase: from systemic to liver-targeting inhibitors. Bioorg Med Chem Lett 21:5692-6 (2011)  
Target
Name:
Acyl-CoA desaturase 1
Synonyms:
ACOD1_RAT Scd Stearoyl-CoA desaturase 1 (SCD1)
Type:
Enzyme
Mol. Mass.:
41485.97
Organism:
Rattus norvegicus (Rat)
Description:
P07308
Residue:
358
  
Inhibitor
Name:
BDBM50354674
Synonyms:
CHEMBL1834457
Type:
Small organic molecule
Emp. Form.:
C18H17BrFN5O3S
Mol. Mass.:
482.327
SMILES:
OC(=O)CNc1nc2cnc(nc2s1)N1CCC(CC1)Oc1cc(F)ccc1Br
: