Target
Cannabinoid receptor 2
Ligand
BDBM50354809
Substrate
Meas. Tech.
ChEMBL_771754 (CHEMBL1838496)
Ki
960±n/a nM
Citation
 Fulp, ABortoff, KZhang, YSeltzman, HSnyder, RMaitra, R Towards rational design of cannabinoid receptor 1 (CB1) antagonists for peripheral selectivity. Bioorg Med Chem Lett 21:5711-4 (2011)  
Target
Name:
Cannabinoid receptor 2
Synonyms:
CANNABINOID CB2 CB2 CB2B CNR2_HUMAN Cannabinoid CB2 receptor Cannabinoid receptor 2 (CB2R) | hCB2
Type:
G Protein-Coupled Receptor (GPCR)
Mol. Mass.:
39690.94
Organism:
Homo sapiens (Human)
Description:
P34972
Residue:
360
  
Inhibitor
Name:
BDBM50354809
Synonyms:
CHEMBL1834021
Type:
Small organic molecule
Emp. Form.:
C26H29Cl3N4O3S
Mol. Mass.:
583.957
SMILES:
Cc1c(nn(c1-c1ccc(Cl)cc1)-c1ccc(Cl)cc1Cl)C(=O)NC[C@H]1CC[C@@H](CNS(C)(=O)=O)CC1
: