Target
Cannabinoid receptor 1
Ligand
BDBM50354805
Substrate
Meas. Tech.
ChEMBL_771756 (CHEMBL1838498)
Ki
21±n/a nM
Citation
 Fulp, ABortoff, KZhang, YSeltzman, HSnyder, RMaitra, R Towards rational design of cannabinoid receptor 1 (CB1) antagonists for peripheral selectivity. Bioorg Med Chem Lett 21:5711-4 (2011)  
Target
Name:
Cannabinoid receptor 1
Synonyms:
CANN6 CB-R CNR CNR1_HUMAN Cannabinoid receptor Cannabinoid receptor 1 (brain)
Type:
G Protein-Coupled Receptor (GPCR)
Mol. Mass.:
52868.96
Organism:
Homo sapiens (Human)
Description:
P21554
Residue:
472
  
Inhibitor
Name:
BDBM50354805
Synonyms:
CHEMBL1834020
Type:
Small organic molecule
Emp. Form.:
C25H28Cl3N5O3S
Mol. Mass.:
584.946
SMILES:
Cc1c(nn(c1-c1ccc(Cl)cc1)-c1ccc(Cl)cc1Cl)C(=O)NCC1CCC(CNS(N)(=O)=O)CC1
: