Target
Cannabinoid receptor 1
Ligand
BDBM50354809
Substrate
Meas. Tech.
ChEMBL_771755 (CHEMBL1838497)
Ki
55±n/a nM
Citation
 Fulp, ABortoff, KZhang, YSeltzman, HSnyder, RMaitra, R Towards rational design of cannabinoid receptor 1 (CB1) antagonists for peripheral selectivity. Bioorg Med Chem Lett 21:5711-4 (2011)  
Target
Name:
Cannabinoid receptor 1
Synonyms:
CANN6 CB-R CNR CNR1_HUMAN Cannabinoid receptor Cannabinoid receptor 1 (brain)
Type:
G Protein-Coupled Receptor (GPCR)
Mol. Mass.:
52868.96
Organism:
Homo sapiens (Human)
Description:
P21554
Residue:
472
  
Inhibitor
Name:
BDBM50354809
Synonyms:
CHEMBL1834021
Type:
Small organic molecule
Emp. Form.:
C26H29Cl3N4O3S
Mol. Mass.:
583.957
SMILES:
Cc1c(nn(c1-c1ccc(Cl)cc1)-c1ccc(Cl)cc1Cl)C(=O)NC[C@H]1CC[C@@H](CNS(C)(=O)=O)CC1
: