Target
Heat shock protein HSP 90-alpha
Ligand
BDBM50354820
Substrate
Meas. Tech.
ChEMBL_771869 (CHEMBL1838880)
Kd
42.0±n/a nM
Citation
 Miura, TFukami, TAHasegawa, KOno, NSuda, AShindo, HYoon, DOKim, SJNa, YJAoki, YShimma, NTsukuda, TShiratori, Y Lead generation of heat shock protein 90 inhibitors by a combination of fragment-based approach, virtual screening, and structure-based drug design. Bioorg Med Chem Lett 21:5778-83 (2011)  
Target
Name:
Heat shock protein HSP 90-alpha
Synonyms:
HS90A_HUMAN HSP86 HSP90AA1 HSPCA Heat shock 86 kDa Heat shock protein HSP 90-alpha (HSP90) LAP-2 Lipopolysaccharide-associated protein 2 heat shock protein 90kDa alpha (cytosolic), class A member 1 isoform 2
Type:
Molecular Chaperone
Mol. Mass.:
84623.45
Organism:
Homo sapiens (Human)
Description:
P07900
Residue:
732
  
Inhibitor
Name:
BDBM50354820
Synonyms:
CHEMBL1834390
Type:
Small organic molecule
Emp. Form.:
C6H10N4S
Mol. Mass.:
170.235
SMILES:
CCSc1nc(C)nc(N)n1
: