Target
Arginase-1
Ligand
BDBM50354832
Substrate
Meas. Tech.
ChEMBL_771086 (CHEMBL1838747)
Kd
6E4±n/a nM
Citation
 Ilies, MDowling, DPLombardi, PMChristianson, DW Synthesis of a new trifluoromethylketone analogue of l-arginine and contrasting inhibitory activity against human arginase I and histone deacetylase 8. Bioorg Med Chem Lett 21:5854-8 (2011)  
Target
Name:
Arginase-1
Synonyms:
ARG1 Liver-type arginase | Type I arginase
Type:
PROTEIN
Mol. Mass.:
34737.53
Organism:
Homo sapiens (Human)
Description:
ChEMBL_978893
Residue:
322
  
Inhibitor
Name:
BDBM50354832
Synonyms:
CHEMBL1834160
Type:
Small organic molecule
Emp. Form.:
C7H13NO3
Mol. Mass.:
159.183
SMILES:
N[C@@H](CCCCC=O)C(O)=O
: