Target
Cystine/glutamate transporter
Ligand
BDBM50355001
Substrate
Meas. Tech.
ChEMBL_772170 (CHEMBL1838227)
IC50
>1000000±n/a nM
Citation
 Shukla, KThomas, AGFerraris, DVHin, NSattler, RAlt, JRojas, CSlusher, BSTsukamoto, T Inhibition of xc¿?¿ transporter-mediated cystine uptake by sulfasalazine analogs. Bioorg Med Chem Lett 21:6184-7 (2011)  
Target
Name:
Cystine/glutamate transporter
Synonyms:
SLC7A11 | XCT_HUMAN
Type:
PROTEIN
Mol. Mass.:
55437.48
Organism:
Homo sapiens (Human)
Description:
ChEMBL_772170
Residue:
501
  
Inhibitor
Name:
BDBM50355001
Synonyms:
CHEMBL1834953
Type:
Small organic molecule
Emp. Form.:
C21H16N2O5S
Mol. Mass.:
408.427
SMILES:
COC(=O)c1cc(ccc1O)C#Cc1ccc(cc1)S(=O)(=O)Nc1ccccn1
: