Target
Adenosine receptor A2a
Ligand
BDBM50343135
Substrate
Meas. Tech.
ChEMBL_772800 (CHEMBL1837539)
Ki
3090±n/a nM
Citation
 Cheong, SLDolzhenko, AVPaoletta, SLee, EPKachler, SFederico, SKlotz, KNDolzhenko, AVSpalluto, GMoro, SPastorin, G Does the combination of optimal substitutions at the C²-, N¿?¿- and N¿?¿-positions of the pyrazolo-triazolo-pyrimidine scaffold guarantee selective modulation of the human A3 adenosine receptors? Bioorg Med Chem 19:6120-34 (2011)  
Target
Name:
Adenosine receptor A2a
Synonyms:
A2A adenosine receptor (hA2A) ADENOSINE A2 ADORA2 Adenosine A2A receptor (A2AAR)
Type:
G Protein-Coupled Receptor (GPCR)
Mol. Mass.:
44716.46
Organism:
Homo sapiens (Human)
Description:
P29274
Residue:
412
  
Inhibitor
Name:
BDBM50343135
Synonyms:
CHEMBL1770311 | N-(2-(4-chlorophenyl)-8-phenethyl-8H-pyrazolo[4,3-e][1,2,4]triazolo[1,5-c]pyrimidin-5-yl)-2-phenylacetamide
Type:
Small organic molecule
Emp. Form.:
C28H22ClN7O
Mol. Mass.:
507.974
SMILES:
Clc1ccc(cc1)-c1nc2c3cn(CCc4ccccc4)nc3nc(NC(=O)Cc3ccccc3)n2n1
: