Target
Rho-associated protein kinase 2
Ligand
BDBM50355393
Substrate
Meas. Tech.
ChEMBL_773557 (CHEMBL1839923)
IC50
>10000±n/a nM
Citation
 Guagnano, VFuret, PSpanka, CBordas, VLe Douget, MStamm, CBrueggen, JJensen, MRSchnell, CSchmid, HWartmann, MBerghausen, JDrueckes, PZimmerlin, ABussiere, DMurray, JGraus Porta, D Discovery of 3-(2,6-dichloro-3,5-dimethoxy-phenyl)-1-{6-[4-(4-ethyl-piperazin-1-yl)-phenylamino]-pyrimidin-4-yl}-1-methyl-urea (NVP-BGJ398), a potent and selective inhibitor of the fibroblast growth factor receptor family of receptor tyrosine kinase. J Med Chem 54:7066-83 (2011)  
Target
Name:
Rho-associated protein kinase 2
Synonyms:
KIAA0619 ROCK2 Rho kinase 2 (ROCKII) Rho-associated protein kinase 2 (ROCK2) Rho-associated protein kinase 2/Transforming protein RhoA Rho-associated, coiled-coil-containing protein kinase II p164 ROCK-2
Type:
Protein
Mol. Mass.:
160885.43
Organism:
Homo sapiens (Human)
Description:
O75116
Residue:
1388
  
Inhibitor
Name:
BDBM50355393
Synonyms:
BGJ398 US9434697, BGJ398 | US9730931, BGJ398
Type:
Small organic molecule
Emp. Form.:
C26H31Cl2N7O3
Mol. Mass.:
560.475
SMILES:
CCN1CCN(CC1)c1ccc(Nc2cc(ncn2)N(C)C(=O)Nc2c(Cl)c(OC)cc(OC)c2Cl)cc1
: