Target
Cytochrome P450 2D6
Ligand
BDBM50355394
Substrate
Meas. Tech.
ChEMBL_772075 (CHEMBL1837841)
IC50
>10000±n/a nM
Citation
 Guagnano, VFuret, PSpanka, CBordas, VLe Douget, MStamm, CBrueggen, JJensen, MRSchnell, CSchmid, HWartmann, MBerghausen, JDrueckes, PZimmerlin, ABussiere, DMurray, JGraus Porta, D Discovery of 3-(2,6-dichloro-3,5-dimethoxy-phenyl)-1-{6-[4-(4-ethyl-piperazin-1-yl)-phenylamino]-pyrimidin-4-yl}-1-methyl-urea (NVP-BGJ398), a potent and selective inhibitor of the fibroblast growth factor receptor family of receptor tyrosine kinase. J Med Chem 54:7066-83 (2011)  
Target
Name:
Cytochrome P450 2D6
Synonyms:
CP2D6_HUMAN CYP2DL1 Cytochrome P450 2D6 (CYP2D6) P450-DB1
Type:
Protein
Mol. Mass.:
55774.82
Organism:
Homo sapiens (Human)
Description:
P10635
Residue:
497
  
Inhibitor
Name:
BDBM50355394
Synonyms:
CHEMBL1834663
Type:
Small organic molecule
Emp. Form.:
C23H26Cl2N6O3
Mol. Mass.:
505.397
SMILES:
COc1cc(OC)c(Cl)c(NC(=O)N(C)c2cc(Nc3cccc(CN(C)C)c3)ncn2)c1Cl
: