Target
Misshapen-like kinase 1
Ligand
BDBM13534
Substrate
Meas. Tech.
ChEMBL_774293 (CHEMBL1908510)
Kd
1100±n/a nM
Citation
 Davis, MIHunt, JPHerrgard, SCiceri, PWodicka, LMPallares, GHocker, MTreiber, DKZarrinkar, PP Comprehensive analysis of kinase inhibitor selectivity. Nat Biotechnol 29:1046-51 (2011)  
Target
Name:
Misshapen-like kinase 1
Synonyms:
B55 MAP4K6 MEK kinase kinase 6 MINK MINK1_HUMAN Misshapen/NIK-related kinase Voltage-gated potassium channel subunit Kv7.1/Misshapen-like kinase 1 ZC3
Type:
PROTEIN
Mol. Mass.:
149838.92
Organism:
Homo sapiens (Human)
Description:
ChEMBL_793919
Residue:
1332
  
Inhibitor
Name:
BDBM13534
Synonyms:
CHEMBL572878 N-[4-[[4-(4-methylpiperazino)-6-[(5-methyl-1H-pyrazol-3-yl)amino]pyrimidin-2-yl]thio]phenyl]cyclopropanecarboxamide VX680 | cyclopropane carboxylic acid {4-[4-(4-methyl-piperazin-1-yl)-6-(5-methyl-2H-pyrazol-3-ylamino)-pyrimidin-2ylsulphanyl]-phenyl}-amide
Type:
Small organic molecule
Emp. Form.:
C23H28N8OS
Mol. Mass.:
464.586
SMILES:
CN1CCN(CC1)c1cc(Nc2cc(C)n[nH]2)nc(Sc2ccc(NC(=O)C3CC3)cc2)n1
: