Target
Serine/threonine-protein kinase MRCK gamma
Ligand
BDBM50332294
Substrate
Meas. Tech.
ChEMBL_774587 (CHEMBL1908804)
Kd
>10000±n/a nM
Citation
 Davis, MIHunt, JPHerrgard, SCiceri, PWodicka, LMPallares, GHocker, MTreiber, DKZarrinkar, PP Comprehensive analysis of kinase inhibitor selectivity. Nat Biotechnol 29:1046-51 (2011)  
Target
Name:
Serine/threonine-protein kinase MRCK gamma
Synonyms:
CDC42-binding protein kinase gamma DMPK-like gamma MRCK gamma MRCKG_HUMAN Myotonic dystrophy protein kinase-like alpha | Myotonic dystrophy protein kinase-like gamma
Type:
PROTEIN
Mol. Mass.:
172450.18
Organism:
Homo sapiens (Human)
Description:
ChEMBL_774587
Residue:
1551
  
Inhibitor
Name:
BDBM50332294
Synonyms:
CHEMBL1287853 US10112907, Example 00018 US10766894, Compound TABLE 1.3 US11384069, Example T-5
Type:
Small organic molecule
Emp. Form.:
C27H36N6O3S
Mol. Mass.:
524.678
SMILES:
Cc1cnc(Nc2ccc(OCCN3CCCC3)cc2)nc1Nc1cccc(c1)S(=O)(=O)NC(C)(C)C
: