Target
Ribosomal protein S6 kinase alpha-1
Ligand
BDBM50242737
Substrate
Meas. Tech.
ChEMBL_774380 (CHEMBL1908597)
Kd
>10000±n/a nM
Citation
 Davis, MIHunt, JPHerrgard, SCiceri, PWodicka, LMPallares, GHocker, MTreiber, DKZarrinkar, PP Comprehensive analysis of kinase inhibitor selectivity. Nat Biotechnol 29:1046-51 (2011)  
Target
Name:
Ribosomal protein S6 kinase alpha-1
Synonyms:
90 kDa ribosomal protein S6 kinase 1 MAP kinase-activated protein kinase 1a RPS6KA1 RPS6KA1(Kin.Dom.2 - C-terminal) RSK1 Ribosomal S6 kinase 1 Ribosomal protein S6 kinase alpha 1 Ribosomal protein S6 kinase alpha-1 (RSK1) p90-RSK 1 p90S6K | pp90RSK1
Type:
Serine/threonine-protein kinase
Mol. Mass.:
82736.10
Organism:
Homo sapiens (Human)
Description:
Residue:
735
  
Inhibitor
Name:
BDBM50242737
Synonyms:
(R,Z)-5-(2,6-dichlorobenzylsulfonyl)-3-((3,5-dimethyl-4-(2-(pyrrolidin-1-ylmethyl)pyrrolidine-1-carbonyl)-1H-pyrrol-2-yl)methylene)indolin-2-one PHA-665752 | TCMDC-125885
Type:
Small organic molecule
Emp. Form.:
C32H34Cl2N4O4S
Mol. Mass.:
641.608
SMILES:
Cc1[nH]c(\C=C2/C(=O)Nc3ccc(cc23)S(=O)(=O)Cc2c(Cl)cccc2Cl)c(C)c1C(=O)N1CCC[C@@H]1CN1CCCC1
: