Target
Serine/threonine-protein kinase OSR1
Ligand
BDBM50326053
Substrate
Meas. Tech.
ChEMBL_774457 (CHEMBL1908674)
Kd
>10000±n/a nM
Citation
 Davis, MIHunt, JPHerrgard, SCiceri, PWodicka, LMPallares, GHocker, MTreiber, DKZarrinkar, PP Comprehensive analysis of kinase inhibitor selectivity. Nat Biotechnol 29:1046-51 (2011)  
Target
Name:
Serine/threonine-protein kinase OSR1
Synonyms:
KIAA1101 OXSR1 Oxidative stress-responsive 1 protein
Type:
PROTEIN
Mol. Mass.:
58020.49
Organism:
Homo sapiens (Human)
Description:
ChEMBL_655500
Residue:
527
  
Inhibitor
Name:
BDBM50326053
Synonyms:
CHEMBL608533 | PKC-412
Type:
Small organic molecule
Emp. Form.:
C35H30N4O4
Mol. Mass.:
570.6371
SMILES:
CO[C@@H]1[C@@H](C[C@H]2O[C@]1(C)n1c3ccccc3c3c4CNC(=O)c4c4c5ccccc5n2c4c13)N(C)C(=O)c1ccccc1
: