Target
Ribosomal protein S6 kinase alpha-5
Ligand
BDBM50322823
Substrate
Meas. Tech.
ChEMBL_774447 (CHEMBL1908664)
Kd
>10000±n/a nM
Citation
 Davis, MIHunt, JPHerrgard, SCiceri, PWodicka, LMPallares, GHocker, MTreiber, DKZarrinkar, PP Comprehensive analysis of kinase inhibitor selectivity. Nat Biotechnol 29:1046-51 (2011)  
Target
Name:
Ribosomal protein S6 kinase alpha-5
Synonyms:
90 kDa ribosomal protein S6 kinase 5 MSK1 Nuclear mitogen- and stress-activated protein kinase 1 RPS6KA5 RSK-like protein kinase Ribosomal protein S6 kinase Ribosomal protein S6 kinase alpha-5
Type:
Serine/threonine-protein kinase
Mol. Mass.:
89874.44
Organism:
Homo sapiens (Human)
Description:
Residue:
802
  
Inhibitor
Name:
BDBM50322823
Synonyms:
(S)-N-(4-(3-chloro-4-fluorophenylamino)-7-(tetrahydrofuran-3-yloxy)quinazolin-6-yl)-4-(dimethylamino)but-2-enamide CHEMBL1173655 US10196365, Afatinib US9388170, Afatinib WO2022090481, Example afatinib
Type:
Small organic molecule
Emp. Form.:
C24H25ClFN5O3
Mol. Mass.:
485.938
SMILES:
CN(C)C\C=C\C(=O)Nc1cc2c(Nc3ccc(F)c(Cl)c3)ncnc2cc1O[C@H]1CCOC1
: