Target
Death-associated protein kinase 1
Ligand
BDBM50332294
Substrate
Meas. Tech.
ChEMBL_774451 (CHEMBL1908668)
Kd
16±n/a nM
Citation
 Davis, MIHunt, JPHerrgard, SCiceri, PWodicka, LMPallares, GHocker, MTreiber, DKZarrinkar, PP Comprehensive analysis of kinase inhibitor selectivity. Nat Biotechnol 29:1046-51 (2011)  
Target
Name:
Death-associated protein kinase 1
Synonyms:
Cellular tumor antigen p53/Death-associated protein kinase 1 DAPK DAPK1_HUMAN Death-associated protein kinase 1 (DAPK1) Death-associated protein kinase 3 (DAPK3)
Type:
PROTEIN
Mol. Mass.:
160053.35
Organism:
Homo sapiens (Human)
Description:
ChEMBL_1517177
Residue:
1430
  
Inhibitor
Name:
BDBM50332294
Synonyms:
CHEMBL1287853 US10112907, Example 00018 US10766894, Compound TABLE 1.3 US11384069, Example T-5
Type:
Small organic molecule
Emp. Form.:
C27H36N6O3S
Mol. Mass.:
524.678
SMILES:
Cc1cnc(Nc2ccc(OCCN3CCCC3)cc2)nc1Nc1cccc(c1)S(=O)(=O)NC(C)(C)C
: