Target
Death-associated protein kinase 1
Ligand
BDBM15138
Substrate
Meas. Tech.
ChEMBL_774451 (CHEMBL1908668)
Kd
1600±n/a nM
Citation
 Davis, MIHunt, JPHerrgard, SCiceri, PWodicka, LMPallares, GHocker, MTreiber, DKZarrinkar, PP Comprehensive analysis of kinase inhibitor selectivity. Nat Biotechnol 29:1046-51 (2011)  
Target
Name:
Death-associated protein kinase 1
Synonyms:
Cellular tumor antigen p53/Death-associated protein kinase 1 DAPK DAPK1_HUMAN Death-associated protein kinase 1 (DAPK1) Death-associated protein kinase 3 (DAPK3)
Type:
PROTEIN
Mol. Mass.:
160053.35
Organism:
Homo sapiens (Human)
Description:
ChEMBL_1517177
Residue:
1430
  
Inhibitor
Name:
BDBM15138
Synonyms:
5-indazolyl pyridine 11g A-674563 indazole-pyridine, 7
Type:
Small organic molecule
Emp. Form.:
C22H22N4O
Mol. Mass.:
358.4363
SMILES:
Cc1n[nH]c2ccc(cc12)-c1cncc(OC[C@@H](N)Cc2ccccc2)c1
: