Target
Ribosomal protein S6 kinase alpha-2
Ligand
BDBM60665
Substrate
Meas. Tech.
ChEMBL_774607 (CHEMBL1908824)
Kd
>10000±n/a nM
Citation
 Davis, MIHunt, JPHerrgard, SCiceri, PWodicka, LMPallares, GHocker, MTreiber, DKZarrinkar, PP Comprehensive analysis of kinase inhibitor selectivity. Nat Biotechnol 29:1046-51 (2011)  
Target
Name:
Ribosomal protein S6 kinase alpha-2
Synonyms:
90 kDa ribosomal protein S6 kinase 2 KS6A2_HUMAN MAPKAPK1C RPS6KA2(Kin.Dom.1 - N-terminal) Ribosomal S6 Kinase 3 (RSK-3) Ribosomal protein S6 kinase alpha 2 (RSK2) p90-RSK 2 pp90RSK3
Type:
Serine/threonine-protein kinase
Mol. Mass.:
83259.46
Organism:
Homo sapiens (Human)
Description:
Residue:
733
  
Inhibitor
Name:
BDBM60665
Synonyms:
BDBM50249542 US9212178, R406
Type:
Emp. Form.:
C22H23FN6O5
Mol. Mass.:
470.4536
SMILES:
COc1cc(Nc2ncc(F)c(Nc3ccc4OC(C)(C)C(=O)Nc4n3)n2)cc(OC)c1OC
: