Target
Ephrin type-A receptor 1
Ligand
BDBM25117
Substrate
Meas. Tech.
ChEMBL_774488 (CHEMBL1908705)
Kd
>10000±n/a nM
Citation
 Davis, MIHunt, JPHerrgard, SCiceri, PWodicka, LMPallares, GHocker, MTreiber, DKZarrinkar, PP Comprehensive analysis of kinase inhibitor selectivity. Nat Biotechnol 29:1046-51 (2011)  
Target
Name:
Ephrin type-A receptor 1
Synonyms:
EPH EPH tyrosine kinase 1 EPHA1_HUMAN EPHT1 Ephrin type-A receptor 1 Erythropoietin-producing hepatoma receptor hEpha1
Type:
Enzyme
Mol. Mass.:
108128.04
Organism:
Homo sapiens (Human)
Description:
P21709
Residue:
976
  
Inhibitor
Name:
BDBM25117
Synonyms:
AG-013736 N-methyl-2-({3-[(E)-2-(pyridin-2-yl)ethenyl]-1H-indazol-6-yl}sulfanyl)benzamide US9205078, Axitinib | US9617222, Compound A
Type:
Small organic molecule
Emp. Form.:
C22H18N4OS
Mol. Mass.:
386.47
SMILES:
CNC(=O)c1ccccc1Sc1ccc2c(\C=C\c3ccccn3)n[nH]c2c1
: