Target
Myotonin-protein kinase
Ligand
BDBM50184807
Substrate
Meas. Tech.
ChEMBL_774430 (CHEMBL1908647)
Kd
>10000±n/a nM
Citation
 Davis, MIHunt, JPHerrgard, SCiceri, PWodicka, LMPallares, GHocker, MTreiber, DKZarrinkar, PP Comprehensive analysis of kinase inhibitor selectivity. Nat Biotechnol 29:1046-51 (2011)  
Target
Name:
Myotonin-protein kinase
Synonyms:
DM1PK DMPK_HUMAN | MDPK
Type:
Enzyme Catalytic Domain
Mol. Mass.:
69359.66
Organism:
Homo sapiens (Human)
Description:
gi_47059024
Residue:
629
  
Inhibitor
Name:
BDBM50184807
Synonyms:
(R)-1-(4-(4-fluoro-2-methyl-1H-indol-5-yloxy)-5-methylpyrrolo[1,2-f][1,2,4]triazin-6-yloxy)propan-2-ol BMS-540215 | CHEMBL377300
Type:
Small organic molecule
Emp. Form.:
C19H19FN4O3
Mol. Mass.:
370.3776
SMILES:
C[C@@H](O)COc1cn2ncnc(Oc3ccc4[nH]c(C)cc4c3F)c2c1C
: