Target
Mitogen-activated protein kinase kinase kinase kinase 5
Ligand
BDBM60665
Substrate
Meas. Tech.
ChEMBL_774541 (CHEMBL1908758)
Kd
>10000±n/a nM
Citation
 Davis, MIHunt, JPHerrgard, SCiceri, PWodicka, LMPallares, GHocker, MTreiber, DKZarrinkar, PP Comprehensive analysis of kinase inhibitor selectivity. Nat Biotechnol 29:1046-51 (2011)  
Target
Name:
Mitogen-activated protein kinase kinase kinase kinase 5
Synonyms:
2.7.11.1 Kinase homologous to SPS1/STE20 MAP4K5 MEK kinase kinase 5 | MEKKK 5
Type:
PROTEIN
Mol. Mass.:
95039.51
Organism:
Homo sapiens (Human)
Description:
ChEMBL_1495741
Residue:
846
  
Inhibitor
Name:
BDBM60665
Synonyms:
BDBM50249542 US9212178, R406
Type:
Emp. Form.:
C22H23FN6O5
Mol. Mass.:
470.4536
SMILES:
COc1cc(Nc2ncc(F)c(Nc3ccc4OC(C)(C)C(=O)Nc4n3)n2)cc(OC)c1OC
: